Thursday, August 9, 2012

ossl_ssl.c:110:1: error: ‘SSLv2_method’ undeclared here (not in a function)

When building any ruby verison  on Ubuntu, If you got following error:
_________________________________________________________________
Error:
ossl_ssl.c:110:1: error: ‘SSLv2_method’ undeclared here (not in a function)
ossl_ssl.c:111:1: error: ‘SSLv2_server_method’ undeclared here (not in a function)
ossl_ssl.c:112:1: error: ‘SSLv2_client_method’ undeclared here (not in a function)
make[1]: *** [ossl_ssl.o] Error 1
make[1]: Leaving directory `/home/shrii/.rvm/src/ruby-1.9.2-p180/ext/openssl’
make: *** [mkmain.sh] Error 1

_________________________________________________________________




Please do this :

sudo rvm pkg install openssl
sudo rvm install ruby-1.9.2-p180 –with-openssl-dir=$rvm_path/usr

Resolved.!

2 comments:

Renu said...

Good Post! Thank you so much for sharing this pretty post, it was so good to read and useful to improve my knowledge as updated one, keep blogging.
Devops Training in electronic city

mohit sona said...

It is nice blog Thank you provide important information and i am searching for same information to save my time Big data hadoop online Training

ivanka hot